FirstName,LastName,NickName,ClassName,IsPaid,RegistrationNumber,PermanentNumber,PrimaryColor,SecondaryColor,Manufacturer,ChassisManufacturer,TransponderNumber,CarID,SponsorName,Email,PhoneNumber,Birthday,Gender,Address1,Address2,City,State,ZipCode,Country,ClubName,ClubRegion,AmericanMotorcyclistAssociationNumber,AmericanMotorcyclistAssociationExpirationDate,AcademyOfModelAeronauticsNumber,AcademyOfModelAeronauticsExpirationDate,HAMCallSign,FAANumber,LocalMembershipType,LocalMembershipCode,LocalMembershipExpirationDate
Brenden,Cassidy,,Istc 21.5 Touring Cars,,485,,,,,,7364417,,,,,,,,,,,,,,,,,,,,,,,
Ray,Zarb,,Istc 21.5 Touring Cars,,489,,,,,,3718075,,,,,,,,,,,,,,,,,,,,,,,
Adam,Pearce,,Istc 21.5 Touring Cars,,490,,,,,,9458676,,,,,,,,,,,,,,,,,,,,,,,
Darryl,Helmers,,Istc 21.5 Touring Cars,,492,,,,,,8074542,,,,,,,,,,,,,,,,,,,,,,,
Nic,Cresswell,,Istc 21.5 Touring Cars,,495,,,,,,7820485,,,,,,,,,,,,,,,,,,,,,,,
Mark,Wallin,,Istc 13.5 Touring Cars,,478,,,,,,,,,,,,,,,,,,,,,,,,,,,,,
Christian,Searl,,Istc 13.5 Touring Cars,,479,,,,,,8170638,,,,,,,,,,,,,,,,,,,,,,,
Alex,Brown,,Istc 13.5 Touring Cars,,482,,,,,,2901368,,,,,,,,,,,,,,,,,,,,,,,
Milenko,Rogic,,Istc 13.5 Touring Cars,,491,,,,,,3474902,,,,,,,,,,,,,,,,,,,,,,,
Stephen,Awizen,,Istc 13.5 Touring Cars,,493,,,,,,7055140,,,,,,,,,,,,,,,,,,,,,,,
James,Westhorp,,Istc 13.5 Touring Cars,,496,,,,,,5718902,,,,,,,,,,,,,,,,,,,,,,,
Dean,Kaufman,,Formula 1,,488,,,,,,9132497,,,,,,,,,,,,,,,,,,,,,,,
James,Westhorp,,Formula 1,,497,,,,,,3864924,,,,,,,,,,,,,,,,,,,,,,,
